{"text_format":"1","workbook":"xlsx","n_sheets":5,"sheets":["Primary Calculator","Personal + Additional Incomes","Investment Portfolio Summary","Tables","Postcodes"],"not_rendered":{"charts":0,"images":1,"macros":1,"external_links":2,"defined_names":93,"comments":2,"pivot_tables":0},"unopened":[],"bounds":{"document_bytes":16777216,"sheet_cells":100000,"rows_first":2000,"rows_last":500,"rows_between":2000,"halvings":0,"cell_chars":16384,"cell_head_chars":4096},"cells_cut":0,"cells_raw":0,"read":"whole","date_system":"1900"}

{"sheet":"Primary Calculator","index":0,"n_rows":115,"n_cols":49,"rows_kept":115,"cut":false,"hidden":false,"merged":[[75,1,76,2],[21,7,22,7],[21,19,22,19],[21,20,22,20],[21,41,22,41],[73,5,73,6],[21,39,22,39],[42,40,42,41],[21,48,22,48],[21,13,22,13],[21,14,22,14],[21,15,22,15],[19,1,20,20],[21,6,22,6],[21,38,22,38],[21,10,22,10],[21,11,22,11],[21,12,22,12],[21,2,22,2],[21,4,22,4],[21,5,22,5],[21,9,22,9],[21,3,22,3],[21,8,22,8],[81,1,87,5],[2,19,2,20],[21,45,22,45],[21,47,22,47],[80,10,84,10],[16,1,16,10],[66,6,66,7],[57,5,57,6],[44,11,44,12],[45,11,45,12],[5,4,5,5],[6,9,6,10],[63,5,63,6],[21,1,22,1],[21,40,22,40],[21,34,22,34],[21,44,22,44],[10,4,10,9],[11,13,11,17],[16,13,16,17],[12,37,15,37],[21,36,22,36],[21,42,22,42],[21,43,22,43],[21,17,22,17],[21,35,22,35],[21,37,22,37],[10,20,14,20]]}
[]
[]
[null,"Non Consumer Investment - Specialist Investment 10",null,null,null,null,null,null,null,null,null,null,null,null,null,null,null,"Created:",null,{"$f":"NOW()","v":"2023-06-01T10:36:55.230"}]
[null,"Version 4.00 1/5/23"]
[]
[]
[null,"Instructions ",null,null,null,null,null,null,null,"Cell Index"]
[null,"Insert the relevant details into blank fields in BLUE cells",null,null,null,"Blue shaded cells require input",null,null,null,"White shaded cells derived from formulas",null,null,null,null,"Light Grey shaded cells applies appropriate scales"]
[]
[]
[null,"Application Name/ Loan No. / Ref:",null,null,null,null,null,null,null,null,null,null,null,null,null,null,null,null,null,null,"Resimac Specialist Inv Rate (actual from rate board)"]
[null,null,null,null,null,null,null,null,null,null,null,null,null,"APL post code checker"]
[null,"Preliminary product questions to determine suitability of Non Consumer product",null,null,null,null,null,null,null,null,null,null,null,null,null,null,null,null,null,null,null,null,null,null,null,null,null,null,null,null,null,null,"Yes",null,null,null,null,"assessment rate"]
[null,null,null,null,null,null,null,null,null,null,null,null,null,null,null,null,null,null,null,null,null,null,null,null,null,null,null,null,null,null,null,null,"No"]
[null,"Lending proposed is wholly not for a consumer purposes",null,null,null,null,null,null,null,null,null,null,null,"Postcode",null,{"$f":"IFERROR(VLOOKUP(O15,Tables!U2:X2070,4,FALSE),0)","v":0}]
[null,"Security property offered is not owner occupied and does not involve any self occupation component  i.e home and income",null,null,null,null,null,null,null,null,null,null,null,null,null,null,null,null,null,null,9.5899999999999999E-2]
[null,"Security property offered is residential, fit for a couple / family to reside in  i.e not a boarding house, purpose built student accomodation or dilapidated",null,null,null,null,null,null,null,null,null,null,null,"Group 1-3 Metro densly populated areas",null,null,null,null,null,null,"check rate",null,null,null,null,null,null,null,null,null,null,null,null,null,null,null,9.5000000000000001E-2,{"$f":"IF(U16=9.59%,9.75%,U16+0.2%)","v":9.7500000000000003E-2}]
[null,"Applicants do not have or will not have any consumer lending with Resimac  (can not have this product and consumer product concurrently)"]
[]
[null,{"$f":"IF(AND(L15=\"yes\",L16=\"yes\",L17=\"yes\",L18=\"yes\"),\"Preliminary pass -within product parameters\",\"no inputs into cell L15- L18 or outside product parameters for a Non consumer product\")","v":"no inputs into cell L15- L18 or outside product parameters for a Non consumer product"}]
{"$rows_left_out":96}
{"sheet":"Personal + Additional Incomes","index":1,"n_rows":98,"n_cols":22,"rows_kept":98,"cut":false,"hidden":false,"merged":[[94,0,95,11],[97,0,97,11],[29,7,29,9],[0,1,0,7],[2,1,2,7],[81,1,82,7],[91,1,92,7],[40,4,40,8]]}
[null,"2.   PERSONAL + ADDITIONAL INCOME WORKSHEET"]
[]
[null,"Note: All figures are to be entered at 100% and calculator will reduce assessment percentage where appropriate"]
[]
[null,"Income: Other"]
[null,null,null,null,null,null,null,null,null,null,null,null,null,null,1,2]
[null,"Incomes Support:",null,null,null,null,null,null,null,null,null,null,null,null,0,1,2,3,4,5]
[null,"Number of Single Adults"]
[null,"Number of Dependent Children"]
[]
[null,"PAYE"]
[null,null,"Base income PAYE","Self Employed Income","Investment Income (non property)","Overtime / Shift Allowance","Bonus / Commission / Casual / 2nd Job","Non Taxable Income","Total allowable Supplementary Income","Taxable Income ","Tax Applied (Including ACC)  ","Total Net Borrower Income After Tax"]
[null,"Individual Applicant 1",null,{"$f":"MIN(L25,Tables!D62)","v":0},null,null,null,null,{"$f":"SUM(E13*Tables!D43)+(AUTO_OvertimeShiftAllowances*Tables!A43)+(AUTO_Bonus*Tables!B43)","v":0},{"$f":"C13+D13+I13","v":0},{"$f":"Tables!C$36+Tables!C$37+Tables!C$38","v":0},{"$f":"SUM(Tables!C$39)","v":0}]
[null,"Individual Applicant 2",null,{"$f":"MIN(L26,Tables!D63)","v":0},null,null,null,null,{"$f":"SUM(E14*Tables!D43)+(AUTO_OvertimeShiftAllowances2*Tables!A43)+(AUTO_Bonus3*Tables!B43)","v":0},{"$f":"C14+D14+I14","v":0},{"$f":"Tables!D$36+Tables!D$37+Tables!D$38","v":0},{"$f":"SUM(Tables!D$39)","v":0}]
[null,"Individual Applicant 3",null,{"$f":"MIN(L27,Tables!D64)","v":0},null,null,null,null,{"$f":"SUM(E15*Tables!D43)+(AUTO_OvertimeShiftAllowances3*Tables!A43)+(AUTO_Bonus3*Tables!B43)","v":0},{"$f":"C15+D15+I15","v":0},{"$f":"Tables!E$36+Tables!E$37+Tables!E$38","v":0},{"$f":"SUM(Tables!E$39)","v":0}]
[null,"Individual Applicant 4",null,{"$f":"MIN(L28,Tables!D65)","v":0},null,null,null,null,{"$f":"SUM(E16*Tables!D43)+(AUTO_OvertimeShiftAllowances3*Tables!A43)+(AUTO_Bonus3*Tables!B43)","v":0},{"$f":"C16+D16+I16","v":0},{"$f":"Tables!F$36+Tables!F$37+Tables!F$38","v":0},{"$f":"SUM(Tables!F$39)","v":0},null,null,null,null,null,"Max Depreciation that can be used company income less tax paid","Tax"]
[null,"Totals for Individuals",{"$f":"SUM(C13:C16)","v":0},{"$f":"SUM(D13:D16)","v":0},0,0,0,0,0,0,0,0,null,null,null,null,null,{"$f":"SUM(T17*20%)","v":0},null,{"$f":"SUM(I61-S17)","v":0}]
[null,null,null,null,null,null,null,null,null,null,null,null,null,null,null,null,null,null,null,{"$f":"SUM(V18*20%)","v":0},{"$f":"SUM(I62*0.28)","v":0},{"$f":"SUM(I62-U18)","v":0}]
[null,"Self Employed",null,null,null,null,null,null,null,null,null,null,null,null,null,null,null,null,null,{"$f":"SUM(V19*20%)","v":0},{"$f":"SUM(I64*0.28)","v":0},{"$f":"SUM(I64-U19)","v":0}]
[]
{"$rows_left_out":79}
{"sheet":"Investment Portfolio Summary","index":2,"n_rows":43,"n_cols":21,"rows_kept":43,"cut":false,"hidden":false,"merged":[[39,4,39,5],[37,2,37,5],[2,13,3,13],[41,2,41,5],[2,7,3,7],[2,10,3,10],[2,11,3,11],[2,12,3,12],[2,8,3,8],[2,9,3,9],[32,7,32,8],[2,1,3,1],[2,2,3,2],[2,3,3,3],[2,5,3,5],[2,6,3,6]]}
[]
[null,"3. Investment Property Summary",null,"do not include Resimac offered security (first tab property/ies)"]
[null,"Property Address","Value","Outstanding Debt/Limits",null,"Lender","Term (yrs)","Rate (%)","Repayment Amount     Per Month","Rental Income     Per Week","Insurance   Per Annum","Rates        Per Annum","Body Corp  Per Annum","APL Location (Group)",null,"Scaled Rent","Expenses","Surplus"]
[null,null,null,null,"LVR",null,null,null,null,null,null,null,null,null,null,null,null,null,"GV",null,"Group1"]
[null,null,null,null,{"$f":"IF(ISERROR(D5/C5),0,(D5/C5))","v":0},null,null,null,null,null,null,null,null,null,null,{"$f":"IF(OR(N5=\"group1\",N5=\"group2\",N5=\"group3\"),J5*Tables!$H$43*52,J5*Tables!$H$43*52)","v":0},{"$f":"SUM(K5+L5+M5)","v":0},{"$f":"SUM(P5-Q5)","v":0},"MV",null,"Group2"]
[null,null,null,null,{"$f":"IF(ISERROR(D6/C6),0,(D6/C6))","v":0},null,null,null,null,null,null,null,null,null,null,{"$f":"IF(OR(N6=\"group1\",N6=\"group2\",N6=\"group3\"),J6*Tables!$H$43*52,J6*Tables!$H$43*52)","v":0},{"$f":"SUM(K6+L6+M6)","v":0},{"$f":"SUM(P6-Q6)","v":0},"Estimate",null,"Group3"]
[null,null,null,null,0,null,null,null,null,null,null,null,null,null,null,{"$f":"IF(OR(N7=\"group1\",N7=\"group2\",N7=\"group3\"),J7*Tables!$H$43*52,J7*Tables!$H$43*52)","v":0},0,0,"PP",null,"Group4"]
[null,null,null,null,0,null,null,null,null,null,null,null,null,null,null,{"$f":"IF(OR(N8=\"group1\",N8=\"group2\",N8=\"group3\"),J8*Tables!$H$43*52,J8*Tables!$H$43*52)","v":0},0,0,null,null,"Group5"]
[null,null,null,null,0,null,null,null,null,null,null,null,null,null,null,{"$f":"IF(OR(N9=\"group1\",N9=\"group2\",N9=\"group3\"),J9*Tables!$H$43*52,J9*Tables!$H$43*52)","v":0},0,0,{"$f":"SUM(I31*12)","v":0}]
[null,null,null,null,0,null,null,null,null,null,null,null,null,null,null,{"$f":"IF(OR(N10=\"group1\",N10=\"group2\",N10=\"group3\"),J10*Tables!$H$43*52,J10*Tables!$H$43*52)","v":0},0,0,{"$f":"SUM(J31*52)","v":0}]
[null,null,null,null,0,null,null,null,null,null,null,null,null,null,null,{"$f":"IF(OR(N11=\"group1\",N11=\"group2\",N11=\"group3\"),J11*Tables!$H$43*52,J11*Tables!$H$43*52)","v":0},0,0]
[null,null,null,null,0,null,null,null,null,null,null,null,null,null,null,{"$f":"IF(OR(N12=\"group1\",N12=\"group2\",N12=\"group3\"),J12*Tables!$H$43*52,J12*Tables!$H$43*52)","v":0},0,0,"Scaled Rent"]
[null,null,null,null,0,null,null,null,null,null,null,null,null,null,null,{"$f":"IF(OR(N13=\"group1\",N13=\"group2\",N13=\"group3\"),J13*Tables!$H$43*52,J13*Tables!$H$43*52)","v":0},0,0,{"$f":"SUM(J31*52)*0.8","v":0}]
[null,null,null,null,0,null,null,null,null,null,null,null,null,null,null,{"$f":"IF(OR(N14=\"group1\",N14=\"group2\",N14=\"group3\"),J14*Tables!$H$43*52,J14*Tables!$H$43*52)","v":0},0,0]
[null,null,null,null,0,null,null,null,null,null,null,null,null,null,null,{"$f":"IF(OR(N15=\"group1\",N15=\"group2\",N15=\"group3\"),J15*Tables!$H$43*52,J15*Tables!$H$43*52)","v":0},0,0]
[null,null,null,null,0,null,null,null,null,null,null,null,null,null,null,{"$f":"IF(OR(N16=\"group1\",N16=\"group2\",N16=\"group3\"),J16*Tables!$H$43*52,J16*Tables!$H$43*52)","v":0},0,0]
[null,null,null,null,0,null,null,null,null,null,null,null,null,null,null,{"$f":"IF(OR(N17=\"group1\",N17=\"group2\",N17=\"group3\"),J17*Tables!$H$43*52,J17*Tables!$H$43*52)","v":0},0,0]
[null,null,null,null,0,null,null,null,null,null,null,null,null,null,null,{"$f":"IF(OR(N18=\"group1\",N18=\"group2\",N18=\"group3\"),J18*Tables!$H$43*52,J18*Tables!$H$43*52)","v":0},0,0]
[null,null,null,null,0,null,null,null,null,null,null,null,null,null,null,{"$f":"IF(OR(N19=\"group1\",N19=\"group2\",N19=\"group3\"),J19*Tables!$H$43*52,J19*Tables!$H$43*52)","v":0},0,0]
[null,null,null,null,0,null,null,null,null,null,null,null,null,null,null,{"$f":"IF(OR(N20=\"group1\",N20=\"group2\",N20=\"group3\"),J20*Tables!$H$43*52,J20*Tables!$H$43*52)","v":0},0,0]
{"$rows_left_out":24}
{"sheet":"Tables","index":3,"n_rows":2075,"n_cols":24,"rows_kept":2075,"cut":false,"hidden":true,"merged":[[29,11,29,13],[53,1,53,2],[20,5,20,7],[44,0,44,1],[45,0,45,1],[40,0,40,7]]}
[null,null,null,null,null,null,null,null,null,null,null,null,null,null,null,null,null,null,null,null,"Postcode","TownCity","Suburb","New Group"]
[null,null,null,null,null,null,null,null,null,null,null,null,null,null,null,null,null,null,null,null,110,"WHANGAREI","ABBEY CAVES","Group3"]
["Living Expenses (Annual)",null,null,null,10,11,12,13,14,15,20,21,22,23,24,25,null,null,null,null,110,"WHANGAREI","AVENUES","Group3"]
[null,null,null,"Adults",1,1,1,1,1,1,2,2,2,2,2,2,null,null,null,null,110,"WHANGAREI","HORAHORA","Group3"]
["Year","Pre-tax monthly income","annualised","Dependants",0,1,2,3,4,5,0,1,2,3,4,5,null,null,null,null,110,"WHANGAREI","MAUNU","Group3"]
[2021,1000,{"$f":"SUM(B6*12)","v":12000},null,500.25373527436199,723.39373086067201,932.31807391739198,1131.4931458640999,1323.32316561518,1509.3017081990699,884.58248700141701,1085.7681115529299,1279.1537182126599,1466.392872486,1648.5878712128299,1826.5229327731699,null,null,null,null,110,"WHANGAREI","MORNINGSIDE","Group3"]
[2021,2000,{"$f":"SUM(B7*12)","v":24000},null,614.54720816962003,888.66822246517495,1145.32571983252,1390.00652033609,1625.66413719824,1854.1333840329501,1086.6839354719,1333.83464155144,1571.40325182428,1801.4211235661501,2025.24239648203,2243.83046011224,null,null,null,null,110,"WHANGAREI","ONERAHI","Group3"]
[2021,3000,36000,null,693.15501745926099,1002.33933059919,1291.8263377871001,1567.8046878477001,1833.6056830503501,2091.2988312306002,1225.6835801242801,1504.44776570716,1772.4041928332499,2031.8440532437301,2284.29469702396,2530.8427425569598,null,null,null,null,110,"WHANGAREI","PORT WHANGAREI","Group3"]
[2021,4000,48000,null,754.95342550904604,1091.70314301703,1406.99943635984,1707.5827048879801,1997.08125395353,2277.74909887802,1334.9597046802101,1638.57718058978,1930.42332964819,2212.9936153664098,2487.9515591066802,2756.4806569843299,null,null,null,null,110,"WHANGAREI","RAUMANGA","Group3"]
[2021,5000,60000,null,806.65760988547299,1166.47016662888,1503.36002738044,1824.5292184454199,2133.8545354304501,2433.7443634762599,1426.3865402619499,1750.79774121984,2062.6314373117598,2364.5539978305401,2658.3428730409501,2945.2626126694299,null,null,null,null,110,"WHANGAREI","WHANGAREI","Group3"]
[2021,6000,72000,null,851.52083986884998,1231.3448032936799,1586.97119750969,1926.0025981487699,2252.5314134526898,2569.0999737888901,1505.7167376303801,1848.1704564290601,2177.3471573509,2496.0615030133699,2806.1897987085199,3109.0669236117101,null,null,null,null,110,"WHANGAREI","WOODHILL","Group3"]
[2021,7000,84000,null,891.39328864393303,1289.00250266527,1661.2810967130799,2016.1876368933299,2358.00615839375,2689.3980361578001,1576.2218981384899,1934.7110064676799,2279.3014007848301,2612.9395402363798,2937.5895880776202,3254.6489291784801,null,null,null,null,112,"WHANGAREI","KAMO","Group3"]
[2021,8000,96000,null,927.43839221955,1341.1256556098799,1728.4580094878199,2097.7158390074001,2453.3564120853998,2798.1487211857698,1639.95928802055,2012.9445533267699,2371.46908492379,2718.5984873750999,3056.3763484378801,3386.2565587725599,null,null,null,null,112,"WHANGAREI","KAMO","Group3"]
[2021,9000,108000,null,960.44036126075002,1388.8482728080801,1789.9634617062,2172.3609623459802,2540.6566500720101,2897.7180491799099,1698.3156016109001,2084.5731751175599,2455.8554441465699,2815.33709973846,3165.1344486800199,3506.7531168789701,null,null,null,null,112,"WHANGAREI","KENSINGTON","Group3"]
[2021,10000,120000,null,990.95548348482498,1432.9747761339099,1846.83420143531,2241.3812398713699,2621.3784224312899,2989.78438042567,1752.27450447311,2150.8042580556398,2533.8829116141201,2904.78602250938,3265.6971368518498,3618.1697173129101,null,null,null,null,112,"WHANGAREI","OTANGAREI","Group3"]
[2021,12500,150000,null,1058.8226436243799,1531.11432955343,1973.31757489548,2394.8857938854499,2800.9076870112599,3194.5445121477701,1872.2818069054299,2298.1055036140901,2707.4199071738399,3103.7249066936702,3489.3535919073302,3865.9658168444698,null,null,null,null,112,"WHANGAREI","PARAHAKI","Group3"]
[2021,15000,180000,null,1117.7103342509799,1616.26908846949,2083.06599740816,2528.0802382672,2956.6835257124399,3372.2129347651098,1976.4110040611199,2425.91739613358,2857.99631092756,3276.3422880804501,3683.41817490841,4080.9761402127801,null,null,null,null,112,"WHANGAREI","REGENT","Group3"]
[2021,20000,240000,null,1217.36007720558,1760.36796120594,2268.78226470768,2753.4718609372699,3220.2873811181298,3672.8634180253398,2152.6184188912798,2642.2006651934498,3112.80168314412,3568.44539998134,4011.81423878653,4444.8165834064703,null,null,null,null,112,"WHANGAREI","RIVERSIDE","Group3"]
[2021,25000,300000,null,1300.7329155258999,1880.92955687678,2424.16342142647,2942.0477544464602,3440.8338769316101,3924.40530251571,2300.0439101358502,2823.1559741392298,3325.9868502211498,3812.8360506674198,4286.5697085644397,4749.2269064576903,null,null,null,null,112,"WHANGAREI","TIKIPUNGA","Group3"]
[2021,1000000,{"$f":"SUM(B20*12)","v":12000000},null,{"$f":"E19*1.05","v":1365.7695613021949},{"$f":"F19*1.05","v":1974.9760347206191},2545.3715924977937,3089.1501421687835,3612.8755707781906,4120.6255676414958,2415.0461056426429,2964.3137728461916,3492.2861927322074,4003.4778532007908,4500.8981939926616,4986.6882517805752,null,null,null,null,112,"WHANGAREI","WHANGAREI HEADS","Group3"]
{"$rows_left_out":2056}
{"sheet":"Postcodes","index":4,"n_rows":0,"n_cols":0,"rows_kept":0,"cut":false,"hidden":true,"merged":[]}