{"text_format":"1","workbook":"xlsx","n_sheets":4,"sheets":["Calculator","Non-Discretionary Expenses","Self Employed and Other Incomes","Tables"],"not_rendered":{"charts":0,"images":1,"macros":1,"external_links":1,"defined_names":93,"comments":1,"pivot_tables":0},"unopened":[],"bounds":{"document_bytes":16777216,"sheet_cells":100000,"rows_first":2000,"rows_last":500,"rows_between":2000,"halvings":0,"cell_chars":16384,"cell_head_chars":4096},"cells_cut":0,"cells_raw":0,"read":"whole","date_system":"1900"}

{"sheet":"Calculator","index":0,"n_rows":93,"n_cols":24,"rows_kept":93,"cut":false,"hidden":false,"merged":[[50,0,50,1],[49,5,50,5],[49,4,50,4],[66,0,72,10],[14,4,14,5],[44,0,44,1],[28,3,28,4],[19,7,25,7],[37,0,38,0],[42,10,43,10],[59,4,60,6],[49,6,50,6],[63,4,64,6],[4,8,4,9],[10,8,10,9],[18,3,18,4],[41,0,41,1],[42,0,42,1],[13,4,13,5],[49,20,49,22],[48,7,48,10],[11,2,11,5],[18,0,18,1],[17,20,17,22],[45,2,45,3]]}
[]
["Refinance Calculator (4AH)",null,null,null,null,null,null,null,null,"Created:",{"$f":"NOW()","v":"2023-08-02T10:14:55.030"}]
["Version 10.0  1/8/23"]
[]
["Instructions ",null,null,null,null,null,null,null,"Cell Index"]
["Insert the relevant details into blank fields in BLUE cells",null,null,null,null,null,null,null,null,"Blue shaded cells require input"]
["Show split loan amounts in correct fields",null,null,null,null,null,null,null,null,"White shaded cells derived from formulas"]
["There must be at least one borrower",null,null,null,null,null,null,null,null,"Light Grey shaded cells applies appropriate scales"]
[]
["1.   LOAN DETAILS"]
[null,null,null,null,null,null,null,null,"Security Position"]
["Application Name / Loan No. / Ref:",null,null,null,null,null,null,null,null,"Value - Owner Occupied Property"]
[null,null,null,null,null,null,null,null,null,"Value - Investment Property/ies"]
["Number of Adult Applicants",null,null,"max 2","Number of Dependents",null,null,"max 5 if more type 5",null,"Total Security Value",{"$f":"SUM(K12:K13)","v":0},null,null,"Adults ",null,null,1,2]
[null,null,null,null,null,null,null,null,null,"Loan to Valuation Ratio (LVR)",{"$f":"IF(ISERROR(C26/K14),0,C26/K14)","v":0},null,null,"Dependants",null,0,1,2,3,4,5]
["Product",null,null,null,null,"Rate Checker  ","resimac.co.nz/"]
[null,null,null,null,null,null,null,null,null,null,null,null,null,"Prime"]
["Interest Rate - Actual",null,null,null,null,"Assessment Rate",{"$f":"IF(C16=\"\",0%,IF(C16=\"Prime\",Tables!B30,IF(C16=\"Prime Alt Doc\",Tables!B32,IF(C16=\"Specialist\",C18+Tables!C31,IF(C16=\"Prime >80% LVR\",Tables!B33,10%)))))","v":0},null,null,null,null,null,null,"Specialist",null,null,null,null,null,null,"current calculations"]
["Loan Term (yrs)",null,"Loan Amount","IO Term (yrs)",null,"Estimated Actual Repayment*",null,null,null,null,null,null,null,null,null,null,null,null,null,null,"PMT","Monthly payments","Max","Total"]
["Portion A",30,null,null,null,{"$f":"-PMT(($C$18/12),((B20-D20)*12),C20,0)","v":0},null,"*If Interest Only, estimated repayment is after Interest Only period has expired (P&I remaining term)",null,null,null,null,null,null,null,null,null,null,null,null,{"$f":"IFERROR(-PMT(H22/12,G22,E22,0),\"0\")*12","v":0},{"$f":"F20*12","v":0},{"$f":"MAX(U20,V20)","v":0},{"$f":"V20*B20","v":0}]
["Portion B",30,null,null,null,0,null,null,null,null,null,null,null,null,null,null,null,null,null,null,{"$f":"IFERROR(-PMT(H23/12,G23,E23,0),\"0\")*12","v":0},{"$f":"F21*12","v":0},{"$f":"MAX(U21,V21)","v":0},{"$f":"V21*B21","v":0}]
["Portion C",30,null,null,null,0,null,null,null,null,null,null,null,null,null,null,null,null,null,null,{"$f":"IFERROR(-PMT(H24/12,G24,E24,0),\"0\")*12","v":0},0,0,0]
["Portion D",30,null,null,null,0,null,null,null,null,null,null,null,null,null,null,null,null,null,null,{"$f":"IFERROR(-PMT(H25/12,G25,E25,0),\"0\")*12","v":0},0,0,0]
["Portion E",30,null,null,null,0,{"$f":"IF(-PMT(($G$18/12),((B24-D24)*12),C24,0),(-PMT(($G$18/12),((B24-D24)*12),C24,0)),\"$\")","v":"$"},null,null,null,null,null,null,null,null,null,null,null,null,null,{"$f":"IFERROR(-PMT(H26/12,G26,E26,0),\"0\")*12","v":0},0,0,{"$f":"SUM(U24*G26/12)","v":0}]
["Portion F",30,0,null,null,0,"$",null,null,null,null,null,null,null,null,null,null,null,null,null,null,null,{"$f":"SUM(W20:W24)","v":0},{"$f":"SUM(X20:X24)","v":0}]
["Total",null,{"$f":"SUM(C20:C25)","v":0},null,null,{"$f":"SUM(F20:F25)","v":0},null,null,null,null,null,null,null,null,null,null,null,null,null,null,null,null,null,{"$f":"SUM(X20:X24)","v":0}]
[]
["2.   INCOME AND EXPENSES"," (Use Self Employed and Other Incomes Tab for Other Income Types)"]
[null,null,"Base Income pa",null,null,"Self Employed Income","Total allowable Supplementary Income","Apportioned and Scaled Rental Income*","Taxable Income ","Tax Applied (Including ACC) ","Total Net Borrower Income After Tax"]
["Individual Applicant 1 ",null,null,null,null,{"$f":"'Self Employed and Other Incomes'!B55","v":0},{"$f":"'Self Employed and Other Incomes'!J9","v":0},{"$f":"'Self Employed and Other Incomes'!J$24","v":0},{"$f":"AUTO_GrossIncome-AUTO_SocialSecurityIncome+F30+G30+H30","v":0},{"$f":"IF(Tables!C$52+Tables!C$53+Tables!C54<0,0,Tables!C$52+Tables!C$53+Tables!C54)","v":0},{"$f":"IF(I30-J30<0,0,I30-J30)","v":0}]
["Individual Applicant 2",null,null,null,null,{"$f":"'Self Employed and Other Incomes'!B56","v":0},{"$f":"'Self Employed and Other Incomes'!J10","v":0},{"$f":"'Self Employed and Other Incomes'!K$24","v":0},{"$f":"AUTO_GrossIncome2-AUTO_SocialSecurityIncome2+F31+G31+H31","v":0},{"$f":"IF(Tables!D$52+Tables!D$53+Tables!D54<0,0,Tables!D$52+Tables!D$53+Tables!D54)","v":0},{"$f":"IF(I31-J31<0,0,I31-J31)","v":0}]
["Individual Applicant 3",null,null,null,null,{"$f":"'Self Employed and Other Incomes'!B57","v":0},{"$f":"'Self Employed and Other Incomes'!J11","v":0},{"$f":"'Self Employed and Other Incomes'!#REF!","v":{"$error":"#REF!"}},{"$f":"AUTO_GrossIncome3-AUTO_SocialSecurityIncome3+F32+G32+H32","v":{"$error":"#REF!"}},{"$f":"Tables!E$52+Tables!E$53+Tables!E54","v":{"$error":"#REF!"}},{"$f":"SUM(I32-J32)","v":{"$error":"#REF!"}}]
["Individual Applicant 4",null,null,null,null,{"$f":"'Self Employed and Other Incomes'!B58","v":0},{"$f":"'Self Employed and Other Incomes'!J12","v":0},{"$f":"'Self Employed and Other Incomes'!#REF!","v":{"$error":"#REF!"}},{"$f":"AUTO_GrossIncome4-AUTO_SocialSecurityIncome4+F33+G33+H33","v":{"$error":"#REF!"}},{"$f":"Tables!F$52+Tables!F$53+Tables!F54","v":{"$error":"#REF!"}},{"$f":"SUM(I33-J33)","v":{"$error":"#REF!"}}]
["Totals for Individuals",null,{"$f":"SUM(C30:C31)","v":0},null,null,{"$f":"SUM(F30:F33)","v":0},{"$f":"SUM(G30:G33)","v":0},{"$f":"SUM(H30:H31)","v":0},{"$f":"SUM(I30:I31)","v":0},{"$f":"SUM(J30:J31)","v":0},{"$f":"SUM(K30:K31)","v":0}]
[null,null,null,null,null,null,null,{"$f":"IF(H30<0,0,H30)","v":0},null,null,null,null,null,"Weekly"]
["Non Discretionary Monthly Living Expenses",null,null,null,"Annualised",null,"Annualised with Buffer",{"$f":"IF(H31<0,0,H31)","v":0},null,null,null,null,null,"Fortnightly"]
[null,null,null,null,null,null,null,null,null,null,null,null,null,"4 weekly"]
["Applicant Advised Living Expenses",null,{"$f":"SUM('Non-Discretionary Expenses'!D27)","v":0},null,{"$f":"SUM(AUTO_TotalDeclaredLivingExpenses*12)","v":0},null,{"$f":"'Non-Discretionary Expenses'!L27*12","v":0},null,null,null,null,null,null,"Monthly"]
[null,null,null,null,null,null,null,null,null,null,null,null,null,"Quarterly"]
["3. Proposed / Ongoing Monthly Financial Expenses",null,null,null,"Limit / Balance","Estimated Repayment Amount pm","Actual Repayment Amount pm",null,null,null,null,null,null,"Annually"]
{"$rows_left_out":54}
{"sheet":"Non-Discretionary Expenses","index":1,"n_rows":43,"n_cols":18,"rows_kept":43,"cut":false,"hidden":false,"merged":[[2,9,4,9],[1,7,1,15]]}
["LIVING EXPENSES"]
[null,null,null,null,null,null,null,"******Hidden Cells***** for Underwriter use*****"]
[null,"MONTHLY NON DISCRETIONARY LIVING EXPENSES",null,null,null,null,null,null,null,"Additional Enquiry (enter all fields if change is made to any)"]
[null,"all catergories must be answered. Mark as n/a where not applicable"]
[null,null,null,"Customer Estimated",null,"Notes",null,"Customer Estimated",null,null,null,"Buffered",null,"Benchmark ",null,"Buffered Benchmark",null,"Adjusted why? verified how?  With what document? Must be answered where customer declares an non benchmarkable expense or if deemed immaterial"]
[null,"Utilities",null,null,null,null,null,{"$f":"D6","v":0},null,null,null,{"$f":"MAX(D6:J6)*1.1","v":0}]
[".","Rates",null,null,null,null,null,0,null,null,null,{"$f":"MAX(D7:J7)*1.1","v":0},null,null,null,null,"Rates"]
[null,"Property Maintenance ",null,null,null,null,null,0,null,null,null,0]
[null,"Food & Takeaways",null,null,null,null,null,0,null,null,null,0]
[null,"Transport",null,null,null,null,null,0,null,null,null,0]
[null,"Clothing and Footwear",null,null,null,null,null,0,null,null,null,0]
[null,"Personal Care",null,null,null,null,null,0,null,null,null,0]
[null,"Childcare",null,null,null,null,null,0,null,null,null,0]
[".","Insurances ",null,null,null,"Supporting document:",null,0,null,null,null,0,null,null,null,null,"Insurance"]
[null,"Communications",null,null,null,null,null,0,null,null,null,0]
[null,"Medical and Health",null,null,null,null,null,0,null,null,null,0]
[null,"Education and Schooling",null,null,null,"Supporting document:",null,0,null,null,null,0,null,null,null,null,"Edu & Sch"]
[null,"Recreation and Entertainment",null,null,null,null,null,0,null,null,null,0]
[null,"Regular Savings ",null,null,null,null,null,0,null,null,null,0]
[".","Body Corp Fees",null,null,null,"Supporting document:",null,0,null,null,null,0,null,null,null,null,"BC fees"]
[null,"Tithings",null,null,null,"Supporting document:",null,0,null,null,null,0,null,null,null,null,"Tithing"]
[".","Child Maintenance",null,null,null,"Supporting document:",null,0,null,null,null,0,null,null,null,null,"Child Maint"]
[".","All Other Regular Expenses",null,null,null,"Supporting document:",null,0,null,null,null,0,null,null,null,null,"Other"]
[]
[".","Rent or Board Paid",null,null,null,"Supporting document:",null,{"$f":"D25","v":0},null,null,null,{"$f":"MAX(D25:J25)","v":0},null,null,null,null,"Rent/Board"]
[]
[null,"Total Monthly Expenses",null,{"$f":"SUM(D6:D25)","v":0},null,null,null,{"$f":"SUM(H6:H25)","v":0},null,{"$f":"SUM(J6:J25)","v":0},null,{"$f":"SUM(L6:L25)","v":0}]
[]
[null,"Annualised",null,{"$f":"SUM(D27*12)","v":0},null,null,"Annualised"]
[null,"Benckmark Items Total",null,{"$f":"SUM(D6+D8+D9+D10+D11+D12+D13+D15+D17)*12","v":0},null,null,"Benchmarked expense type",null,null,{"$f":"SUM(J6+J8+J9+J10+J11+J12+J13+J15+J16+J18)*12","v":0},null,{"$f":"SUM(L6+L8+L9+L10+L11+L12+L13+L15+L16+L18)*12","v":0},null,{"$f":"Tables!B25","v":11984.385570298704},null,{"$f":"Tables!B25","v":11984.385570298704}]
[null,"Non Benchmark Total",null,null,null,null,"Not Benchmarked expense type",null,null,{"$f":"SUM(J7+J14+J17+J19+J20+J21+J22+J23+J25)*12","v":0},null,{"$f":"SUM(L7+L14+L17+L19+L20+L21+L22+L23+L25)*12","v":0},null,null,null,{"$f":"SUM(L31)","v":0}]
[null,null,null,{"$f":"SUM(D7+D14+D16+D18+D19+D20+D21+D22+D23+D25)*12","v":0}]
[]
[null,null,null,null,null,null,"Total",{"$f":"SUM(H27*12)","v":0},null,{"$f":"SUM(J30+J31)","v":0},null,{"$f":"SUM(L30+L31)","v":0},null,null,null,{"$f":"P30+P31","v":11984.385570298704}]
[]
[]
[]
[]
[]
[]
{"$rows_left_out":4}
{"sheet":"Self Employed and Other Incomes","index":2,"n_rows":61,"n_cols":31,"rows_kept":61,"cut":false,"hidden":false,"merged":[[0,0,0,6],[2,0,2,6],[60,1,60,3],[39,8,39,9],[54,3,57,4],[8,9,8,10],[9,9,9,10],[10,9,10,10],[11,9,11,10],[12,9,12,10],[47,9,47,10],[48,9,48,10],[46,9,46,10],[33,9,33,10],[45,9,45,10],[26,3,26,4],[16,7,16,8],[26,5,26,6],[49,11,49,12],[37,11,37,12],[49,9,49,10],[48,11,48,12],[16,9,16,10],[7,9,7,10],[34,9,34,10],[36,9,36,10],[35,9,35,10],[47,11,47,12],[33,11,33,12],[45,11,45,12],[34,11,34,12],[35,11,35,12],[36,11,36,12],[46,11,46,12],[37,9,37,10],[17,9,17,10]]}
["SELF EMPLOYED + OTHER INCOME WORKSHEET"]
[]
["Note: All figures are to be entered at 100% and calculator will reduce assessment percentage where appropriate"]
[]
["2.   INCOME AND EXPENSES"]
[]
["Additional Incomes"]
[null,"Base Income","Overtime / Shift Allowance pa","Bonus pa","Commission pa","Investment Income pa","Casual / Second Job pa","Child Support/ Maintenance pa*","Working For Families, Company Car Addback pa","Total allowable Supplementary Income"]
["Individual Applicant 1",{"$f":"AUTO_GrossIncome","v":0},null,null,null,null,null,null,null,{"$f":"SUM(C9*Tables!$A$59,D9*Tables!$B$59,E9*Tables!$C$59,F9*Tables!$D$59,G9*Tables!$E$59,H9*Tables!$F$59,I9*Tables!$G$59)","v":0}]
["Individual Applicant 2",{"$f":"AUTO_GrossIncome2","v":0},null,null,null,null,null,null,null,{"$f":"SUM(C10*Tables!$A$59,D10*Tables!$B$59,E10*Tables!$C$59,F10*Tables!$D$59,G10*Tables!$E$59,H10*Tables!$F$59,I10*Tables!$G$59)","v":0}]
["Individual Applicant 3",{"$f":"AUTO_GrossIncome3","v":0},null,null,null,null,null,null,null,{"$f":"SUM(C11*Tables!$A$59,D11*Tables!$B$59,E11*Tables!$C$59,F11*Tables!$D$59,G11*Tables!$E$59,H11*Tables!$F$59,I11*Tables!$G$59)","v":0}]
["Individual Applicant 4",{"$f":"AUTO_GrossIncome4","v":0},null,null,null,null,null,null,null,{"$f":"SUM(C12*Tables!$A$59,D12*Tables!$B$59,E12*Tables!$C$59,F12*Tables!$D$59,G12*Tables!$E$59,H12*Tables!$F$59,I12*Tables!$G$59)","v":0}]
["Totals for Individuals",{"$f":"Calculator!C34","v":0},{"$f":"SUM(C9:C12)","v":0},0,0,0,0,0,0,0]
[]
["Boarder Income p.w",null,"*must be existing and evidenced continuously over last 90 days",null,null,null,null,"*max age 13 must be through IRD"]
[]
["Taxable Rental Income",null,null,null,null,null,null,"Applicant Ownership%/Tax Split % =100%",null,"Taxable Rental Income Split Per Applicant"]
["Address","Gross  Rental Income pa","Rates pa","Insurances pa","Body Corp pa","Regular Maintenance pa","Lending against security that is tax deductable",1,2,"TaxaTaxable profit/ loss"]
[null,null,null,null,null,null,null,null,null,{"$f":"Tables!E75-Tables!I75","v":0},{"$f":"Tables!F75-Tables!J75","v":0}]
[null,null,null,null,null,null,null,null,null,{"$f":"Tables!E76-Tables!I76","v":0},{"$f":"Tables!F76-Tables!J76","v":0}]
[null,null,null,null,null,null,null,null,null,{"$f":"Tables!E77-Tables!I77","v":0},{"$f":"Tables!F77-Tables!J77","v":0}]
[null,null,null,null,null,null,null,null,null,{"$f":"Tables!E78-Tables!I78","v":0},{"$f":"Tables!F78-Tables!J78","v":0}]
[null,null,null,null,null,null,null,null,null,{"$f":"Tables!E79-Tables!I79","v":0},{"$f":"Tables!F79-Tables!J79","v":0}]
[null,{"$f":"SUM(B19:B23)","v":0},0,0,0,0,{"$f":"SUM(G19:G23)","v":0},null,null,{"$f":"SUM(J19:J23)","v":0},{"$f":"SUM(K19:K23)","v":0},"*",null,null,null,null,null,null,null,null,null,null,null,null,null,null,null,null,null,null,"*"]
[]
["If interest exempt max term","New Build","CCC issued","Max deductable term (yrs)",null,null,null,null,"* Automatically added to Calculator worksheet and scaled 80%"]
[null,null,null,{"$f":"IF(C27=\"\",\"\",IF(C27>Tables!F63,Tables!D75,\"not valid CCC outside range\"))","v":""},null,"*if no deductability is being claimed (G17-G21)max term 30 years"]
[]
["Self Employed"]
[]
["Most Recent Year"]
["Financial Year End dd/mm/yyyy"]
[]
[null,"Net Profit Before Tax","Shareholder Salary*","Director Fees*","Wages / Salary*","Home Office","One off / Significant Item","Interest**","Depreciation***","%  Depn Addback",null,"Total Income"]
["Individual Applicant 1",null,null,null,null,null,null,null,null,{"$f":"IF(I35<Tables!D98,I35,Tables!D98)","v":0},null,{"$f":"SUM(B35,C35,D35,E35,F35,G35,H35,J35)","v":0}]
["Individual Applicant 2",null,null,null,null,null,null,null,null,{"$f":"IF(I36<Tables!D99,I36,Tables!D99)","v":0},null,{"$f":"SUM(B36,C36,D36,E36,F36,G36,H36,J36)","v":0}]
["Individual Applicant 3",null,null,null,null,null,null,null,null,{"$f":"IF(I37<Tables!D100,I37,Tables!D100)","v":0},null,{"$f":"SUM(B37,C37,D37,E37,F37,G37,H37,J37)","v":0}]
["Individual Applicant 4",null,null,null,null,null,null,null,null,{"$f":"IF(I38<Tables!D101,I38,Tables!D101)","v":0},null,{"$f":"SUM(B38,C38,D38,E38,F38,G38,H38,J38)","v":0}]
[]
[null,null,null,null,"*paid to applicants",null,null,"**Where being refinanced or repaid","***not all asset depreciation is suitable for addback i.e core business assets -taxi drivers vehicle"]
{"$rows_left_out":22}
{"sheet":"Tables","index":3,"n_rows":107,"n_cols":19,"rows_kept":107,"cut":false,"hidden":true,"merged":[[35,1,35,3],[19,5,19,7],[27,0,27,2],[95,2,95,3],[92,1,93,2],[61,0,61,1],[60,0,60,1],[66,5,66,6],[84,0,84,3],[72,0,72,1],[72,4,72,7],[56,0,56,7]]}
[]
["Living Expenses (Annual)",null,null,null,10,11,12,13,14,15,20,21,22,23,24,25]
[null,null,null,"Adults",1,1,1,1,1,1,2,2,2,2,2,2]
["Year","Pre-tax monthly income","annualised","Dependants",0,1,2,3,4,5,0,1,2,3,4,5]
[2022,1000,{"$f":"SUM(B5*12)","v":12000},null,566.64876388389905,834.27510134163299,1083.6456779765999,1320.70304967065,1548.57039524632,1769.1613084200001,998.69879752489203,1239.5847144423899,1470.3809372212099,1693.32727014631,1909.8879314947501,2121.09050102009]
[2022,2000,{"$f":"SUM(B6*12)","v":24000},null,709.57744557828801,1044.7085267812499,1356.9791043400801,1653.8306550418299,1939.1741328887599,2215.40580701208,1250.6056428899501,1552.2514321272699,1841.26255267753,2120.4437659810301,2391.6286174913798,2656.1038785969799]
[2022,3000,36000,null,809.36117199267699,1191.61977722857,1547.80313988587,1886.39918811285,2211.86885050107,2526.9453694957501,1426.4710006462401,1770.53547313634,2100.1885373721202,2418.6293719923801,2727.9493632249,3029.6162335931599]
[2022,4000,48000,null,888.55775105259204,1308.2206387009501,1699.2568023285,2070.9847200233198,2428.3018254825502,2774.2088109116999,1566.05222505958,1943.78365630703,2305.6935125258301,2655.2940143102701,2994.88119155091,3326.0663844871501]
[2022,5000,60000,null,955.28615048220001,1406.4646405318799,1826.86661328894,2226.5103405545901,2610.6610406877398,2982.5447501529702,1683.6587152146799,2089.75680444417,2478.8451590944601,2854.6997584839601,3219.7890584366501,3575.84540669537]
[2022,6000,72000,null,1013.51043111158,1492.1880563735999,1938.21334883083,2362.2151896484802,2769.7797099832801,3164.32957183696,1786.2769908688199,2217.1265842401899,2629.9297070145099,3028.6924828280598,3416.0338188272299,3793.7916486058298]
[2022,7000,84000,null,1065.4984373044899,1568.7298259838699,2037.6339808135699,2483.3849912989099,2911.8555291316802,3326.64382172253,1877.9040490745199,2330.8540675040199,2764.8319218296501,3184.0492297546798,3591.2592352381998,3988.3941486570802]
[2022,8000,96000,null,1112.6831635864501,1638.1997424641199,2127.8689340348301,2593.35966321264,3040.80466814896,3473.9615208105101,1961.06549299322,2434.0740322902502,2887.27024072308,3325.0522440381401,3750.29521134995,4165.0169193905804]
[2022,9000,108000,null,1156.0344758178601,1702.02573611362,2210.7729569999301,2694.39969704033,3159.2776323472799,3609.3107338633299,2037.47067757332,2528.9081295619799,2999.76134133307,3454.5997942611798,3896.4106770887802,4327.2903812623499]
[2022,10000,120000,null,1196.2428044656699,1761.2243254258201,2287.6664125846801,2788.11429707464,3269.1612698929698,3734.8470869868602,2108.3364625718,2616.8667253656199,3104.0968022560501,3574.7551069096398,4031.9327262390698,4477.7989668140099]
[2022,12500,150000,null,1286.0775592428499,1893.4877378297299,2459.4642703601799,2997.4945025257798,3514.6668645026598,4015.3244875089299,2266.66710280293,2813.3866790741999,3337.2064803200101,3843.21001189957,4334.7204933944004,4814.0701407124798]
[2022,15000,180000,null,1364.46343417959,2008.8950023022901,2609.3675614348999,3180.1905051968001,3728.88430053927,4260.0567906630304,2404.8194893107402,2984.86138896995,3540.6077821500899,4077.4520116789299,4598.9198459443296,5107.4856484123202]
[2022,20000,240000,null,1497.9771731366,2205.4668386818398,2864.6960742504698,3491.3744580300199,4093.7583401300999,4676.9064445583699,2640.1328245688801,3276.93224578218,3887.0588275453601,4476.4336552026798,5048.9274961418696,5607.2568320928804]
[2022,25000,300000,null,1610.47140215782,2371.0917200876802,3079.8273740006198,3753.5676909603199,4401.1890517128704,5028.1300774147703,2838.4000024268798,3523.0214206740602,4178.9669379001198,4812.6022977142702,5428.0889521694298,6028.34738377965]
[2022,1000000,{"$f":"SUM(B19*12)","v":12000000},null,{"$f":"E18*1.05","v":1690.9949722657111},{"$f":"F18*1.05","v":2489.6463060920642},3233.818742700651,3941.2460755083362,4621.2485042985145,5279.5365812855089,2980.3200025482238,3699.1724917077636,4387.9152847951264,5053.2324125999839,5699.4933997779017,6329.7647529686328]
[]
["Adults",{"$f":"AUTO_NumberAdults","v":0},{"$f":"IF(B21=1,\"10\",\"20\")","v":"20"},"Gross income",{"$f":"SUM('Self Employed and Other Incomes'!B13+'Self Employed and Other Incomes'!C13+'Self Employed and Other Incomes'!D13+'Self Employed and Other Incomes'!E13+'Self Employed and Other Incomes'!G13+'Self Employed and Other Incomes'!H13+'Self Employed and Other Incomes'!I13)/12","v":0}]
["Dependants",{"$f":"AUTO_NumberChildren","v":0},{"$f":"B22","v":0},"Roundup 000's",{"$f":"ROUNDUP(E21,-3)","v":0},null,null,null,null,null,null,null,"Adults ",null,1,2]
[null,null,{"$f":"SUM(C21+C22)","v":20},null,null,null,null,null,null,null,null,null,"Dependants",0,1,2,3,4,5]
["Income banded expense",{"$f":"_xlfn.XLOOKUP(C23,E2:P2,_xlfn.XLOOKUP(E22,B5:B19,E5:P19,,1))","v":998.69879752489203}]
["annualised",{"$f":"SUM(B24*12)","v":11984.385570298704}]
[]
[]
["Benchmark Servicing Interest Rates ",null,null,null,"KS %",null,null,"DTI"]
[null,"Floor","Loading",null,null,null,"Gross Income",{"$f":"Calculator!C34+Calculator!F34+'Self Employed and Other Incomes'!C13+'Self Employed and Other Incomes'!D13+'Self Employed and Other Incomes'!E13+'Self Employed and Other Incomes'!F13+'Self Employed and Other Incomes'!G13+'Self Employed and Other Incomes'!H13+'Self Employed and Other Incomes'!I13+'Self Employed and Other Incomes'!B15+'Self Employed and Other Incomes'!B24","v":0}]
["Prime",0.09,null,null,0.03,null,"Total Debts",{"$f":"AUTO_ExistingOwnerOccupiedLoans+AUTO_ExistingInvestmentLoans+Calculator!E43+Calculator!E44+AUTO_CreditCardLimit+Calculator!E46","v":0}]
["Specialist",0,1.7500000000000002E-2,null,0.04,null,"DTI",{"$f":"IF(ISERROR(H30/H29),0,(H30/H29))","v":0}]
["Prime Alt Doc",9.5000000000000001E-2,null,null,0.06]
["Prime >80% LVR",0.1,null,null,0.08]
[null,null,null,null,0.1]
[]
[null,"Tax Rates effective  01/04/2021"]
[null,"Tax Boundary","Tax Due","Excess %"]
[null,0,0,0.105]
[null,14000,{"$f":"C38+D38*(B39-B38)","v":1470},0.17499999999999999]
[null,48000,{"$f":"C39+D39*(B40-B39)","v":7420},0.3]
{"$rows_left_out":67}