{"text_format":"1","workbook":"xlsx","n_sheets":4,"sheets":["MENU","Premium","Rate Cards","DATA"],"not_rendered":{"charts":1,"images":6,"macros":1,"external_links":1,"defined_names":16,"comments":0,"pivot_tables":0},"unopened":[],"bounds":{"document_bytes":16777216,"sheet_cells":100000,"rows_first":2000,"rows_last":500,"rows_between":2000,"halvings":0,"cell_chars":16384,"cell_head_chars":4096},"cells_cut":0,"cells_raw":0,"read":"whole","date_system":"1900"}

{"sheet":"MENU","index":0,"n_rows":136,"n_cols":9,"rows_kept":136,"cut":false,"hidden":false,"merged":[[28,5,28,11],[29,5,31,11],[135,1,138,11],[9,12,9,14],[24,6,24,9],[25,6,25,7],[25,8,25,9],[26,6,26,7],[26,8,26,9]]}
[]
[]
[]
[]
[]
[null,null,null,null,null,"Enables you to calculate the Lenders Mortgage Insurance (LMI) "]
[null,null,null,null,null,"premium rate for your customers in our easy-to-use spreadsheet"]
[null,null,null,null,null,"In just a few steps, you will obtain the applicable premium rate"]
[null,null,null,null,null,"The calculator will be updated and reissued to you by Genworth to "]
[null,null,null,null,null,"reflect any changes to our policy or pricing, ensuring you receive the"]
[null,null,null,null,null,"most accurate premium rate."]
[]
[]
[]
[]
[]
[]
[null,null,null,null,null,"The Quick Guide details how to use the Genworth LMI Premium"]
[null,null,null,null,null,"Calculator. If you have any questions please contact your"]
[null,null,null,null,null,"Genworth Relationship Manager."]
[]
[]
[]
[null,null,null,null,null,"Disclaimer"]
[null,null,null,null,null,null,"VERSION 2020-08"]
[null,null,null,null,null,null,"Effective date",null,"2020-07-01"]
[null,null,null,null,null,null,"Valid until ",null,"2021-06-30"]
[]
[null,null,null,null,null,"Prepared for:"]
[null,null,null,null,null,"Resimac"]
[]
[]
[null,null,null,null,null," "]
["  Confidential. Genworth Financial Mortgage Insurance Pty Limited ABN 60 106 974 305. "]
["  ® Genworth, Genworth Financial and the Genworth logo are registered service marks of Genworth Financial, Inc and used pursuant to licence."]
["  © 2020 Genworth Financial Mortgage Insurance Pty Limited. All rights reserved."]
[]
[]
[]
[]
[]
[]
[]
[]
[]
[]
[]
[]
[]
[]
[]
[]
[]
[]
[]
[]
[]
[]
[]
[]
{"$rows_left_out":77}
{"sheet":"Premium","index":1,"n_rows":79,"n_cols":23,"rows_kept":79,"cut":false,"hidden":false,"merged":[[47,13,47,14],[4,4,4,6],[48,13,48,14]]}
[]
[]
[]
[null,null,null,null,null,null,null,null,null,null,"Resimac LMI Premium Calculator"]
[null,null,null,null,"Click on any field label below for a description of required content.",null,null,null,null,null,null,null,null,null,null,null,null,null,null,null,null,"RITC - (1=Yes, 2=No)",{"$f":"DATA!$C$77","v":1}]
[]
[null,null,null,null,"POLICY DETAILS",null,null,null,"LOAN DETAILS",null,null,null,null,null,"TOTAL LOAN AMOUNT"]
[]
[null,null,null,null,"Borrower Name",null,null,null,"Predominant Loan Purpose",null,1]
[]
[null,null,null,null,"Lenders Reference Number",null,null,null,"New Loan or Top-up?",null,1,null,null,null,"TOTAL CAPITALISED LOAN AMOUNT"]
[]
[null,null,null,null,"LMI Product",null,1,null,"New Loan Amount"]
[]
[null,null,null,null,"Self Employed?",null,1,null,"Existing Loan Balance",null,null,null,null,null,"TOTAL SECURITY VALUE"]
[]
[null,null,null,null,"First Home Buyer?",null,2,null,"Loan Term",null,1]
[]
[null,null,null,null,{"$f":"IF(AND($G$17=1,$K$9>1),\"Error: FHB Not eligible\",\"\")","v":""},null,{"$f":"IF($G$13=2,IF($G$17=1,\"Error: FHB not eligible\",\"\"),\"\")","v":""},null,{"$f":"IF($K$13>0,IF($K$11=2,\"Premium credit amount\",\"\"),\"\")","v":""},null,null,null,null,null,"TOTAL PREMIUM PAYABLE"]
[]
[null,null,null,null,{"$f":"IF($K$11=2,IF($G$17=1,\"Error: FHB not eligible\",\"\"),\"\")","v":""},null,{"$f":"IF($G$13=2,IF($K$17>1,\"Error: LMI Product Mismatch\",\"\"),\"\")","v":""},null,null,null,{"$f":"IF($K$11=1,IF($K$19<>\"Not Used\",IF($K$19>0,\"Error: Reset\",\"\"),\"\"),\"\")","v":""}]
[]
[]
[]
[]
[null,null,null,null,"SECURITY DETAILS"]
[]
[null,null,null,null,"STATE OF SECURITY",null,"OCCUPANCY TYPE",null,"VALUE"]
[]
[null,null,null,null,1,null,1,null,null,null,null,null,null,null,"BASE LVR %"]
[]
[null,null,null,null,1,null,1]
[]
[null,null,null,null,1,null,1,null,null,null,null,null,null,null,"CAPITALISED LVR %"]
[]
[null,null,null,null,1,null,1]
[]
[null,null,null,null,1,null,1]
[]
[]
[]
[null,null,null,null,"PREMIUM PAYABLE TO GENWORTH",null,null,null,"LENDER's CHARGE TO BORROWER"]
[]
[null,null,null,null,"Premium Amount",null,null,null,"Premium Amount"]
[]
[null,null,null,null,"GST. (1/11th of Premium)",null,null,null,"GST. (25% x 1/11th of Premium)",null,null,null,null,null,"DATE"]
[]
[null,null,null,null,"Stamp Duty",null,null,null,"Stamp Duty",null,null,null,null,{"$f":"TODAY()","v":"2020-08-24"}]
[]
[null,null,null,null,"Total Premium",null,null,null,"Total Premium"]
[]
[]
[]
[null,null,null,null,"EFFECTIVE DATE:",null,"2020-07-01",null,"VALID UNTIL:",null,"2021-06-30",null,null,null,"VERSION NO. 20200824"]
[]
[]
[]
[null,"*Please contact the customer service center at 1300 661 118 between 8.30 am and 5:30 pm AEST for any queries."]
[]
[null,null,null,null,"PREMIUM PAYABLE TO GENWORTH",null,{"$f":"IF(AND($O$62<>0,$O$66<>0,$O$70<>0,$O$74<>0,$E$19=\"\",$E$21=\"\",$G$19=\"\",$G$21=\"\",$K$21=\"\",$G$62<>\"Refer\"),\"\",\"**********Error**********\")","v":"**********Error**********"},null,"LENDER's CHARGE TO BORROWER",null,{"$f":"IF(AND($O$62<>0,$O$66<>0,$O$70<>0,$O$74<>0,$E$19=\"\",$E$21=\"\",$G$19=\"\",$G$21=\"\",$K$21=\"\",$G$62<>\"Refer\"),\"\",\"**********Error**********\")","v":"**********Error**********"},null,null,null,"TOTAL LOAN AMOUNT",null,null,null,null,"BASE LVR %"]
{"$rows_left_out":20}
{"sheet":"Rate Cards","index":2,"n_rows":148,"n_cols":25,"rows_kept":148,"cut":false,"hidden":true,"merged":[[147,2,147,11],[147,15,147,24],[117,2,117,11],[117,15,117,24],[27,2,27,11],[27,15,27,24],[57,2,57,11],[57,15,57,24],[87,2,87,11],[87,15,87,24]]}
["STANDARD\n\n",null,"TO $300,000","FROM $300,001 TO $500,000","FROM $500,001 TO $600,000","FROM $600,001 TO $750,000","FROM $750,001 TO $1.0M","FROM $1.0M TO $1.5M","FROM $1.5M TO $2.0M","FROM $2.0M TO $2.5M","FROM $2.5M TO $3.0M","FROM $3.0M TO $3.5M",null,"STANDARD\nFirst Home Buyer",null,"TO $300,000","FROM $300,001 TO $500,000","FROM $500,001 TO $600,000","FROM $600,001 TO $750,000","FROM $750,001 TO $1.0M","FROM $1.0M TO $1.5M","FROM $1.5M TO $2.0M","FROM $2.0M TO $2.5M","FROM $2.5M TO $3.0M","FROM $3.0M TO $3.5M"]
[null,null,0,300001,500001,600001,750001,1000001,1500001,2000001,2500001,3000001,null,null,null,0,300001,500001,600001,750001,1000001,1500001,2000001,2500001,3000001]
["Up to 60%",1.0000000000000001E-5,0.38,0.4,0.43,0.43,0.43,0.48,0.48,0.48,0.48,0.48,null,"Up to 60%",1.0000000000000001E-5,0.36,0.38,0.41,0.41,0.41,0.45,0.45,0.45,0.45,0.45]
["above 60% to 65%",0.60001000000000004,0.4,0.44,0.55000000000000004,0.55000000000000004,0.55000000000000004,0.61,0.61,0.61,0.61,0.61,null,"above 60% to 65%",0.60001000000000004,0.38,0.41,0.52,0.52,0.52,0.57999999999999996,0.57999999999999996,0.57999999999999996,0.57999999999999996,0.57999999999999996]
["above 65% to 70%",0.65000999999999998,0.42,0.46,0.63,0.63,0.63,0.69,0.69,0.69,0.69,0.69,null,"above 65% to 70%",0.65000999999999998,0.4,0.43,0.59,0.59,0.59,0.66,0.66,0.66,0.66,0.66]
["above 70% to 75%",0.70001000000000002,0.44,0.5,0.85,0.85,0.85,0.93,0.93,0.93,0.93,0.93,null,"above 70% to 75%",0.70001000000000002,0.41,0.48,0.8,0.8,0.8,0.88,0.88,0.88,0.88,0.88]
["above 75% to 80%",0.75000999999999995,0.48,0.55000000000000004,0.91,0.91,0.91,1.01,1.01,1.01,1.01,1.01,null,"above 75% to 80%",0.75000999999999995,0.46,0.52,0.86,0.86,0.86,0.95,0.95,0.95,0.95,0.95]
["above 80% to 81%",0.80001,0.54,0.63,1,1,1,1.1000000000000001,1.1000000000000001,1.1000000000000001,1.1000000000000001,1.1000000000000001,null,"above 80% to 81%",0.80001,0.51,0.59,0.95,0.95,0.95,1.04,1.04,1.04,1.04,1.04]
["above 81% to 82%",0.81001000000000001,0.55000000000000004,0.63,1,1,1,1.1000000000000001,1.1000000000000001,1.1000000000000001,1.1000000000000001,1.1000000000000001,null,"above 81% to 82%",0.81001000000000001,0.52,0.59,0.95,0.95,0.95,1.04,1.04,1.04,1.04,1.04]
["above 82% to 83%",0.82001000000000002,0.77,0.95,1.17,1.17,1.17,1.28,1.28,1.28,1.28,1.28,null,"above 82% to 83%",0.82001000000000002,0.73,0.9,1.1100000000000001,1.1100000000000001,1.1100000000000001,1.22,1.22,1.22,1.22,1.22]
["above 83% to 84%",0.83001000000000003,0.77,0.95,1.24,1.24,1.24,1.37,1.37,1.37,1.37,1.37,null,"above 83% to 84%",0.83001000000000003,0.73,0.9,1.18,1.18,1.18,1.3,1.3,1.3,1.3,1.3]
["above 84% to 85%",0.84001000000000003,0.97,1.25,1.43,1.43,1.43,1.58,1.58,1.58,1.58,1.58,null,"above 84% to 85%",0.84001000000000003,0.92,1.19,1.36,1.36,1.36,1.49,1.49,1.49,1.49,1.49]
["above 85% to 86%",0.85001000000000004,1,1.25,1.57,1.57,1.57,1.72,1.72,1.72,1.72,1.72,null,"above 85% to 86%",0.85001000000000004,0.95,1.19,1.49,1.49,1.49,1.63,1.63,1.63,1.63,1.63]
["above 86% to 87%",0.86001000000000005,1.18,1.43,1.74,1.74,1.74,1.91,1.91,1.91,1.91,1.91,null,"above 86% to 87%",0.86001000000000005,1.1200000000000001,1.35,1.65,1.65,1.65,1.81,1.81,1.81,1.81,1.81]
["above 87% to 88%",0.87000999999999995,1.18,1.43,1.83,1.83,1.83,2.02,2.02,2.02,2.02,2.02,null,"above 87% to 88%",0.87000999999999995,1.1200000000000001,1.35,1.74,1.74,1.74,1.92,1.92,1.92,1.92,1.92]
["above 88% to 89%",0.88000999999999996,1.53,2,2.35,2.35,2.35,2.57,2.57,2.57,2.57,2.57,null,"above 88% to 89%",0.88000999999999996,1.45,1.9,2.2200000000000002,2.2200000000000002,2.2200000000000002,2.44,2.44,2.44,2.44,2.44]
["above 89% to 90%",0.89000999999999997,1.72,2.19,2.78,2.78,2.78,3.06,3.06,3.06,3.06,3.06,null,"above 89% to 90%",0.89000999999999997,1.63,2.0699999999999998,2.64,2.64,2.64,2.9,2.9,2.9,2.9,2.9]
["above 90% to 91%",0.90000999999999998,2.2000000000000002,2.84,3.84,3.84,3.84,4.22,4.22,4.22,4.22,4.22,null,"above 90% to 91%",0.90000999999999998,2.09,2.69,3.64,3.64,3.64,4,4,4,4,4]
["above 91% to 92%",0.91000999999999999,2.2000000000000002,2.84,3.99,3.99,3.99,4.3899999999999997,4.3899999999999997,4.3899999999999997,4.3899999999999997,4.3899999999999997,null,"above 91% to 92%",0.91000999999999999,2.09,2.69,3.78,3.78,3.78,4.16,4.16,4.16,4.16,4.16]
["above 92% to 93%",0.92000999999999999,2.54,3.21,4.1399999999999997,4.1399999999999997,4.1399999999999997,4.5599999999999996,4.5599999999999996,4.5599999999999996,4.5599999999999996,4.5599999999999996,null,"above 92% to 93%",0.92000999999999999,2.4,3.04,3.92,3.92,3.92,4.32,4.32,4.32,4.32,4.32]
["above 93% to 94%",0.93001,2.54,3.21,4.53,4.53,4.53,4.99,4.99,4.99,4.99,4.99,null,"above 93% to 94%",0.93001,2.4,3.04,4.29,4.29,4.29,4.7300000000000004,4.7300000000000004,4.7300000000000004,4.7300000000000004,4.7300000000000004]
["above 94% to 95%",0.94001000000000001,2.82,3.54,4.76,4.76,4.76,5.23,5.23,5.23,5.23,5.23,null,"above 94% to 95%",0.94001000000000001,2.67,3.36,4.51,4.51,4.51,4.96,4.96,4.96,4.96,4.96]
["above 95% to 96%",0.95001000000000002,"Refer","Refer","Refer","Refer","Refer","Refer","Refer","Refer","Refer","Refer",null,"above 95% to 96%",0.95001000000000002,"Refer","Refer","Refer","Refer","Refer","Refer","Refer","Refer","Refer","Refer"]
["above 96% to 97%",0.96001000000000003,"Refer","Refer","Refer","Refer","Refer","Refer","Refer","Refer","Refer","Refer",null,"above 96% to 97%",0.96001000000000003,"Refer","Refer","Refer","Refer","Refer","Refer","Refer","Refer","Refer","Refer"]
["above 97% to 98%",0.97001000000000004,"Refer","Refer","Refer","Refer","Refer","Refer","Refer","Refer","Refer","Refer",null,"above 97% to 98%",0.97001000000000004,"Refer","Refer","Refer","Refer","Refer","Refer","Refer","Refer","Refer","Refer"]
["above 98% to 99%",0.98001000000000005,"Refer","Refer","Refer","Refer","Refer","Refer","Refer","Refer","Refer","Refer",null,"above 98% to 99%",0.98001000000000005,"Refer","Refer","Refer","Refer","Refer","Refer","Refer","Refer","Refer","Refer"]
["above 99% to 100%",0.99000999999999995,"Refer","Refer","Refer","Refer","Refer","Refer","Refer","Refer","Refer","Refer",null,"above 99% to 100%",0.99000999999999995,"Refer","Refer","Refer","Refer","Refer","Refer","Refer","Refer","Refer","Refer"]
[null,null,"MINIMUM PREMIUM - FLAT FEE (WHERE APPLICABLE) OTHERWISE $1200",null,null,null,null,null,null,null,null,null,null,null,null,"MINIMUM PREMIUM - FLAT FEE (WHERE APPLICABLE) OTHERWISE $1200"]
[]
[]
["Business Select",null,"TO $300,000","FROM $300,001 TO $500,000","FROM $500,001 TO $600,000","FROM $600,001 TO $750,000","FROM $750,001 TO $1.0M","FROM $1.0M TO $1.5M","FROM $1.5M TO $2.0M","FROM $2.0M TO $2.5M","FROM $2.5M TO $3.0M","FROM $3.0M TO $3.5M",null,"Business Select\nFirst Home Buyer",null,"TO $300,000","FROM $300,001 TO $500,000","FROM $500,001 TO $600,000","FROM $600,001 TO $750,000","FROM $750,001 TO $1.0M","FROM $1.0M TO $1.5M","FROM $1.5M TO $2.0M","FROM $2.0M TO $2.5M","FROM $2.5M TO $3.0M","FROM $3.0M TO $3.5M"]
[null,null,0,300001,500001,600001,750001,1000001,1500001,2000001,2500001,3000001,null,null,null,0,300001,500001,600001,750001,1000001,1500001,2000001,2500001,3000001]
["Up to 60%",1.0000000000000001E-5,0.59,0.62,0.67,0.67,0.67,0.74,0.74,0.74,0.74,0.74,null,"Up to 60%",1.0000000000000001E-5,"Refer","Refer","Refer","Refer","Refer","Refer","Refer","Refer","Refer","Refer"]
["above 60% to 65%",0.60001000000000004,0.65,0.71,0.98,0.98,0.98,1.0900000000000001,1.0900000000000001,1.0900000000000001,1.0900000000000001,1.0900000000000001,null,"above 60% to 65%",0.60001000000000004,"Refer","Refer","Refer","Refer","Refer","Refer","Refer","Refer","Refer","Refer"]
["above 65% to 70%",0.65000999999999998,0.65,0.71,0.98,0.98,0.98,1.0900000000000001,1.0900000000000001,1.0900000000000001,1.0900000000000001,1.0900000000000001,null,"above 65% to 70%",0.65000999999999998,"Refer","Refer","Refer","Refer","Refer","Refer","Refer","Refer","Refer","Refer"]
["above 70% to 75%",0.70001000000000002,0.88,1.01,1.66,1.66,1.66,1.84,1.84,1.84,1.84,1.84,null,"above 70% to 75%",0.70001000000000002,"Refer","Refer","Refer","Refer","Refer","Refer","Refer","Refer","Refer","Refer"]
["above 75% to 80%",0.75000999999999995,0.88,1.01,1.66,1.66,1.66,1.84,1.84,1.84,1.84,1.84,null,"above 75% to 80%",0.75000999999999995,"Refer","Refer","Refer","Refer","Refer","Refer","Refer","Refer","Refer","Refer"]
["above 80% to 81%",0.80001,"Refer","Refer","Refer","Refer","Refer","Refer","Refer","Refer","Refer","Refer",null,"above 80% to 81%",0.80001,"Refer","Refer","Refer","Refer","Refer","Refer","Refer","Refer","Refer","Refer"]
["above 81% to 82%",0.81001000000000001,"Refer","Refer","Refer","Refer","Refer","Refer","Refer","Refer","Refer","Refer",null,"above 81% to 82%",0.81001000000000001,"Refer","Refer","Refer","Refer","Refer","Refer","Refer","Refer","Refer","Refer"]
["above 82% to 83%",0.82001000000000002,"Refer","Refer","Refer","Refer","Refer","Refer","Refer","Refer","Refer","Refer",null,"above 82% to 83%",0.82001000000000002,"Refer","Refer","Refer","Refer","Refer","Refer","Refer","Refer","Refer","Refer"]
["above 83% to 84%",0.83001000000000003,"Refer","Refer","Refer","Refer","Refer","Refer","Refer","Refer","Refer","Refer",null,"above 83% to 84%",0.83001000000000003,"Refer","Refer","Refer","Refer","Refer","Refer","Refer","Refer","Refer","Refer"]
["above 84% to 85%",0.84001000000000003,"Refer","Refer","Refer","Refer","Refer","Refer","Refer","Refer","Refer","Refer",null,"above 84% to 85%",0.84001000000000003,"Refer","Refer","Refer","Refer","Refer","Refer","Refer","Refer","Refer","Refer"]
["above 85% to 86%",0.85001000000000004,"Refer","Refer","Refer","Refer","Refer","Refer","Refer","Refer","Refer","Refer",null,"above 85% to 86%",0.85001000000000004,"Refer","Refer","Refer","Refer","Refer","Refer","Refer","Refer","Refer","Refer"]
["above 86% to 87%",0.86001000000000005,"Refer","Refer","Refer","Refer","Refer","Refer","Refer","Refer","Refer","Refer",null,"above 86% to 87%",0.86001000000000005,"Refer","Refer","Refer","Refer","Refer","Refer","Refer","Refer","Refer","Refer"]
["above 87% to 88%",0.87000999999999995,"Refer","Refer","Refer","Refer","Refer","Refer","Refer","Refer","Refer","Refer",null,"above 87% to 88%",0.87000999999999995,"Refer","Refer","Refer","Refer","Refer","Refer","Refer","Refer","Refer","Refer"]
["above 88% to 89%",0.88000999999999996,"Refer","Refer","Refer","Refer","Refer","Refer","Refer","Refer","Refer","Refer",null,"above 88% to 89%",0.88000999999999996,"Refer","Refer","Refer","Refer","Refer","Refer","Refer","Refer","Refer","Refer"]
["above 89% to 90%",0.89000999999999997,"Refer","Refer","Refer","Refer","Refer","Refer","Refer","Refer","Refer","Refer",null,"above 89% to 90%",0.89000999999999997,"Refer","Refer","Refer","Refer","Refer","Refer","Refer","Refer","Refer","Refer"]
["above 90% to 91%",0.90000999999999998,"Refer","Refer","Refer","Refer","Refer","Refer","Refer","Refer","Refer","Refer",null,"above 90% to 91%",0.90000999999999998,"Refer","Refer","Refer","Refer","Refer","Refer","Refer","Refer","Refer","Refer"]
["above 91% to 92%",0.91000999999999999,"Refer","Refer","Refer","Refer","Refer","Refer","Refer","Refer","Refer","Refer",null,"above 91% to 92%",0.91000999999999999,"Refer","Refer","Refer","Refer","Refer","Refer","Refer","Refer","Refer","Refer"]
["above 92% to 93%",0.92000999999999999,"Refer","Refer","Refer","Refer","Refer","Refer","Refer","Refer","Refer","Refer",null,"above 92% to 93%",0.92000999999999999,"Refer","Refer","Refer","Refer","Refer","Refer","Refer","Refer","Refer","Refer"]
["above 93% to 94%",0.93001,"Refer","Refer","Refer","Refer","Refer","Refer","Refer","Refer","Refer","Refer",null,"above 93% to 94%",0.93001,"Refer","Refer","Refer","Refer","Refer","Refer","Refer","Refer","Refer","Refer"]
["above 94% to 95%",0.94001000000000001,"Refer","Refer","Refer","Refer","Refer","Refer","Refer","Refer","Refer","Refer",null,"above 94% to 95%",0.94001000000000001,"Refer","Refer","Refer","Refer","Refer","Refer","Refer","Refer","Refer","Refer"]
["above 95% to 96%",0.95001000000000002,"Refer","Refer","Refer","Refer","Refer","Refer","Refer","Refer","Refer","Refer",null,"above 95% to 96%",0.95001000000000002,"Refer","Refer","Refer","Refer","Refer","Refer","Refer","Refer","Refer","Refer"]
["above 96% to 97%",0.96001000000000003,"Refer","Refer","Refer","Refer","Refer","Refer","Refer","Refer","Refer","Refer",null,"above 96% to 97%",0.96001000000000003,"Refer","Refer","Refer","Refer","Refer","Refer","Refer","Refer","Refer","Refer"]
["above 97% to 98%",0.97001000000000004,"Refer","Refer","Refer","Refer","Refer","Refer","Refer","Refer","Refer","Refer",null,"above 97% to 98%",0.97001000000000004,"Refer","Refer","Refer","Refer","Refer","Refer","Refer","Refer","Refer","Refer"]
["above 98% to 99%",0.98001000000000005,"Refer","Refer","Refer","Refer","Refer","Refer","Refer","Refer","Refer","Refer",null,"above 98% to 99%",0.98001000000000005,"Refer","Refer","Refer","Refer","Refer","Refer","Refer","Refer","Refer","Refer"]
["above 99% to 100%",0.99000999999999995,"Refer","Refer","Refer","Refer","Refer","Refer","Refer","Refer","Refer","Refer",null,"above 99% to 100%",0.99000999999999995,"Refer","Refer","Refer","Refer","Refer","Refer","Refer","Refer","Refer","Refer"]
[null,null,"MINIMUM PREMIUM - $1200",null,null,null,null,null,null,null,null,null,null,null,null,"MINIMUM PREMIUM - $1200"]
[]
[]
{"$rows_left_out":89}
{"sheet":"DATA","index":3,"n_rows":117,"n_cols":15,"rows_kept":117,"cut":false,"hidden":true,"merged":[[116,0,116,2],[104,0,104,2],[112,0,112,2],[84,0,84,2],[73,0,73,2],[113,0,113,2],[91,0,91,2],[96,0,96,2],[100,0,100,2],[0,0,0,2],[0,4,0,11],[2,0,2,2],[2,4,2,11],[8,4,8,10],[36,4,36,11],[12,0,12,2],[20,0,20,2],[26,0,26,2],[29,4,29,11],[33,0,33,2],[83,4,83,11],[45,0,45,2],[45,4,45,11],[52,0,52,2],[55,4,55,11],[65,0,65,2]]}
["LOADERS/STAMP DUTY",null,null,null,"CALCULATIONS"]
[]
["PURPOSE",null,null,null,"LOAN AMOUNT"]
[]
[null,null,"Loader",null,"Loan Amount",null,{"$f":"Premium!K13","v":0}]
[null,null,null,null,"Existing Loan Balances",null,{"$f":"Premium!K15","v":0}]
[1,"Purchase or Construction",1,null,"Total Loan Amount",null,{"$f":"SUM(G5:G6)","v":0}]
[2,"Home Improvement/Renovation",1]
[3,"Internal Refinance",1,null,"STAMP DUTY"]
[4,"External Refinance/Debt Consolidation",1.05]
[5,"Equity Release (or Cash-out)",1.05,null,"#","STATE","TYPE","VALUE","STAMP DUTY %","APPORTIONED","STAMP DUTY %"]
[null,null,null,null,1,{"$f":"INDEX($B$36:$B$44,Premium!E30)","v":"Select State of Security"},{"$f":"INDEX($B$49:$B$51,Premium!G30)","v":"Occupancy Type"},{"$f":"Premium!I30","v":0},{"$f":"IF(ISNA(VLOOKUP(F12,$B$56:$C$64,2,FALSE)),\"\",VLOOKUP(F12,$B$56:$C$64,2,FALSE))","v":0},{"$f":"IFERROR($H$12:$H$27/$H$28,\"\")","v":""},{"$f":"IFERROR(ROUND($L$100*I12*J12,2),0)","v":0}]
["GEOGRAPHIC LOCATION",null,null,null,2,{"$f":"INDEX($B$36:$B$44,Premium!E32)","v":"Select State of Security"},{"$f":"INDEX($B$49:$B$51,Premium!G32)","v":"Occupancy Type"},{"$f":"Premium!I32","v":0},{"$f":"IF(ISNA(VLOOKUP(F13,$B$56:$C$64,2,FALSE)),\"\",VLOOKUP(F13,$B$56:$C$64,2,FALSE))","v":0},{"$f":"IFERROR($H$12:$H$27/$H$28,\"\")","v":""},{"$f":"IFERROR(ROUND($L$100*I13*J13,2),0)","v":0}]
[null,null,null,null,3,{"$f":"INDEX($B$36:$B$44,Premium!E34)","v":"Select State of Security"},{"$f":"INDEX($B$49:$B$51,Premium!G34)","v":"Occupancy Type"},{"$f":"Premium!I34","v":0},0,"",0]
[null,null,"Loader",null,4,{"$f":"INDEX($B$36:$B$44,Premium!E36)","v":"Select State of Security"},{"$f":"INDEX($B$49:$B$51,Premium!G36)","v":"Occupancy Type"},{"$f":"Premium!I36","v":0},0,"",0]
[1,"No",null,null,5,{"$f":"INDEX($B$36:$B$44,Premium!E38)","v":"Select State of Security"},{"$f":"INDEX($B$49:$B$51,Premium!G38)","v":"Occupancy Type"},{"$f":"Premium!I38","v":0},0,"",{"$f":"IFERROR(ROUND($L$100*I16*J16,2),0)","v":0}]
[2,"Geographic LMI Policy 1"]
[3,"Geographic LMI Policy 2"]
[4,"Geographic LMI Policy 1 & 2"]
[]
["SELF-EMPLOYED"]
[]
[null,null,"Loader"]
[1,"No",1]
[2,"Yes",1.1000000000000001]
[]
["LMI Product"]
[1,"Standard",null,null,null,null,null,{"$f":"SUM(H12:H27)","v":0},null,null,{"$f":"SUM(K12:K27)","v":0},null,null,null,{"$f":"SUM(O12:O27)","v":0}]
[2,"Business Select"]
[3,"HomeBuyer Plus",null,null,"SECURITIES"]
[4,"Family Pledge"]
[5,"Staff Discount",null,null,null,null,"VALUE","% of Total "]
[null,null,null,null,"Owner Occupied",null,{"$f":"SUMIFS($H$12:$H$27,$G$12:$G$27,$E33)","v":0},{"$f":"IFERROR(G33/$G$35,0)","v":0},null,null,"Predominant Security Type"]
["SECURITY STATE",null,null,null,"Investment",null,{"$f":"SUMIFS($H$12:$H$27,$G$12:$G$27,$E34)","v":0},{"$f":"IFERROR(G34/$G$35,0)","v":0},null,null,{"$f":"IF(H34>H33,E34,E33)","v":"Owner Occupied"}]
[null,null,"Loader",null,null,null,{"$f":"SUM(G33:G34)","v":0}]
[1,"Select State of Security",0]
[2,"New South Wales",0,null,"LOAN VALUE"]
[3,"Queensland",0.09]
[4,"Victoria",0.1]
[5,"South Australia",0.11]
[6,"Western Australia",0.1]
[7,"Tasmania",0.1]
[8,"Northern Territory",0.1]
[9,"Aust. Capital Territory",0]
[]
["OCCUPANCY TYPE",null,null,null,"LOAN PURPOSE"]
[]
[null,null,"Loader",null,null,null,"APPLY LOADER","VALUE","% of Total ",null,"Apply Loader"]
[1,"Occupancy Type",1,null,1,{"$f":"VLOOKUP(Premium!$K$9,DATA!$A$6:$B$11,2,FALSE)","v":"Purchase or Construction"},{"$f":"IF(OR(F49=$B$10,F49=$B$11),\"Y\",\"N\")","v":"N"},{"$f":"G5","v":0},{"$f":"IFERROR(H49/$H$54,0)","v":0},null,"N",{"$f":"SUMIFS($H$49:$H$53,$G$49:$G$53,$K49)","v":0}]
[2,"Owner Occupied",1,null,null,null,null,null,null,null,"Y",{"$f":"SUMIFS($H$49:$H$53,$G$49:$G$53,$K50)","v":0}]
[3,"Investment",1.1499999999999999]
[]
["STAMP DUTY",null,null,null,null,null,null,null,null,null,"Predominant  Loan Purpose"]
[null,null,null,null,null,null,null,{"$f":"SUM(H49:H53)","v":0},null,null,{"$f":"IF(L50>L49,\"Refinance\",\"Purchase\")","v":"Purchase"}]
[null,null,"Stamp Duty"]
[1,"Select State of Security",0,null,"POLICY SUMMARY"]
[2,"New South Wales",0]
[3,"Queensland",0.09,null,"Total Loan Amount",null,{"$f":"G7","v":0}]
[4,"Victoria",0.1,null,"Total Security Value",null,{"$f":"H28","v":0}]
[5,"South Australia",0.11,null,"Base LVR",null,{"$f":"IFERROR(ROUND(G58/G59,4),0)","v":0}]
{"$rows_left_out":57}